Target
Glucocorticoid receptor
Ligand
BDBM50531586
Substrate
Meas. Tech.
ChEMBL_1920446 (CHEMBL4423291)
Ki
158±n/a nM
Citation
 Granberg, KLYuan, ZQLindmark, BEdman, KKajanus, JHogner, AMalmgren, MO'Mahony, GNordqvist, ALindberg, JTångefjord, SKossenjans, MLöfberg, CBrånalt, JLiu, DSelmi, NNikitidis, GNordberg, PHayen, AAagaard, AHansson, EHermansson, MIvarsson, IJansson-Löfmark, RKarlsson, UJohansson, UWilliam-Olsson, LHartleib-Geschwindner, JBamberg, K Identification of Mineralocorticoid Receptor Modulators with Low Impact on Electrolyte Homeostasis but Maintained Organ Protection. J Med Chem 62:1385-1406 (2019)  
Target
Name:
Glucocorticoid receptor
Synonyms:
GCR_HUMAN GRL Glucocorticoid receptor (GRFP) Nuclear receptor subfamily 3 group C member 1
Type:
Enzyme
Mol. Mass.:
85656.87
Organism:
Homo sapiens (Human)
Description:
P04150
Residue:
777
  
Inhibitor
Name:
BDBM50531586
Synonyms:
CHEMBL4462110
Type:
Small organic molecule
Emp. Form.:
C20H18ClN3O5
Mol. Mass.:
415.827
SMILES:
CNC(=O)C[C@H]1COc2ccc(Cl)cc2N1C(=O)c1ccc2OCC(=O)Nc2c1
: