Target
Alpha-2C adrenergic receptor
Ligand
BDBM50085677
Substrate
Meas. Tech.
ChEMBL_33673 (CHEMBL646814)
Ki
26±n/a nM
Citation
 Ross, TMJetter, MCMcDonnell, MEBoyd, REConnelly, CDMartinez, RPLewis, MACodd, EERaffa, RBReitz, AB Alpha(2) adrenoceptor agonists as potential analgesic agents. 2. Discovery of 4-(4-imidazo)-1,3-dimethyl-6,7-dihydro-thianaphthene as a high-affinity ligand for the alpha(2D) adrenergic receptor. J Med Chem 43:1423-6 (2001)  
Target
Name:
Alpha-2C adrenergic receptor
Synonyms:
ADA2C_RAT Adrenergic receptor alpha adrenergic Alpha2 | adrenergic Alpha2C
Type:
Enzyme Catalytic Domain
Mol. Mass.:
49890.50
Organism:
RAT
Description:
adrenergic Alpha2 0 RAT::P22086
Residue:
458
  
Inhibitor
Name:
BDBM50085677
Synonyms:
4-(1,3-Dimethyl-6,7-dihydro-benzo[c]thiophen-4-yl)-1H-imidazole | CHEMBL284795
Type:
Small organic molecule
Emp. Form.:
C13H14N2S
Mol. Mass.:
230.329
SMILES:
Cc1sc(C)c2c1CCC=C2c1cnc[nH]1
: