Target
Alpha-2A adrenergic receptor [16-465]
Ligand
BDBM50085677
Substrate
Meas. Tech.
ChEMBL_33223 (CHEMBL643883)
Ki
25±n/a nM
Citation
 Ross, TMJetter, MCMcDonnell, MEBoyd, REConnelly, CDMartinez, RPLewis, MACodd, EERaffa, RBReitz, AB Alpha(2) adrenoceptor agonists as potential analgesic agents. 2. Discovery of 4-(4-imidazo)-1,3-dimethyl-6,7-dihydro-thianaphthene as a high-affinity ligand for the alpha(2D) adrenergic receptor. J Med Chem 43:1423-6 (2001)  
Target
Name:
Alpha-2A adrenergic receptor [16-465]
Synonyms:
ADA2A_RAT Adrenaline 2 Alpha-2A adrenoceptor Alpha-2AAR Alpha2 Adrenoreceptor adrenergic Alpha2A
Type:
G-protein coupled receptor
Mol. Mass.:
48961.69
Organism:
Rattus norvegicus (rat)
Description:
P22909[16-465]
Residue:
450
  
Inhibitor
Name:
BDBM50085677
Synonyms:
4-(1,3-Dimethyl-6,7-dihydro-benzo[c]thiophen-4-yl)-1H-imidazole | CHEMBL284795
Type:
Small organic molecule
Emp. Form.:
C13H14N2S
Mol. Mass.:
230.329
SMILES:
Cc1sc(C)c2c1CCC=C2c1cnc[nH]1
: