Target
M-phase inducer phosphatase 1
Ligand
BDBM50087141
Substrate
Meas. Tech.
ChEBML_49002
IC50
7700±n/a nM
Citation
 Dodo, KTakahashi, MYamada, YSugimoto, YHashimoto, YShirai, R Synthesis of a novel class of cdc25A inhibitors from vitamin D3. Bioorg Med Chem Lett 10:615-7 (2000)  
Target
Name:
M-phase inducer phosphatase 1
Synonyms:
CDC25A Dual specificity phosphatase Cdc25A MPIP1_HUMAN | phosphatase Cdc25
Type:
Protein
Mol. Mass.:
59090.18
Organism:
Homo sapiens (Human)
Description:
P30304
Residue:
524
  
Inhibitor
Name:
BDBM50087141
Synonyms:
(E)-2-((1R,7aR)-7a-methyl-1-((R)-6-methylheptan-2-yl)-octahydroinden-4-ylidene)acetic acid [(1R,7aR)-1-((R)-1,5-Dimethyl-hexyl)-7a-methyl-octahydro-inden-(4E)-ylidene]-acetic acid
Type:
Small organic molecule
Emp. Form.:
C20H34O2
Mol. Mass.:
306.4828
SMILES:
CC(C)CCC[C@@H](C)[C@H]1CCC2\C(CCC[C@]12C)=C\C(O)=O
: