Target
Protein kinase C alpha type
Ligand
BDBM50085904
Substrate
Meas. Tech.
ChEBML_160293
Ki
2.9±n/a nM
Citation
 Nacro, KBienfait, BLewin, NEBlumberg, PMMarquez, VE Diacylglycerols with lipophilically equivalent branched acyl chains display high affinity for protein kinase C (PK-C). A direct measure of the effect of constraining the glycerol backbone in DAG lactones. Bioorg Med Chem Lett 10:653-5 (2000)  
Target
Name:
Protein kinase C alpha type
Synonyms:
KPCA_HUMAN PKC alpha and beta-2 PKC-alpha PRKACA Protein Kinase C- alpha Protein kinase C alpha (PKCa) Protein kinase C alpha type (PRKCA) RAF proto-oncogene serine/threonine-protein kinase
Type:
Enzyme
Mol. Mass.:
76755.65
Organism:
Homo sapiens (Human)
Description:
The recombinant human PKC enzymes were produced using a baculovirus expression system in SF9 cells
Residue:
672
  
Inhibitor
Name:
BDBM50085904
Synonyms:
3-Isopropyl-4-methyl-pentanoic acid 2-hydroxymethyl-4-(3-isopropyl-4-methyl-pentylidene)-5-oxo-tetrahydro-furan-2-ylmethyl ester CHEMBL290876
Type:
Small organic molecule
Emp. Form.:
C24H42O5
Mol. Mass.:
410.5873
SMILES:
CC(C)C(C\C=C1\CC(CO)(COC(=O)CC(C(C)C)C(C)C)OC1=O)C(C)C
: