Target
Protein kinase C alpha type
Ligand
BDBM50087237
Substrate
Meas. Tech.
ChEBML_160293
Ki
50±n/a nM
Citation
 Nacro, KBienfait, BLewin, NEBlumberg, PMMarquez, VE Diacylglycerols with lipophilically equivalent branched acyl chains display high affinity for protein kinase C (PK-C). A direct measure of the effect of constraining the glycerol backbone in DAG lactones. Bioorg Med Chem Lett 10:653-5 (2000)  
Target
Name:
Protein kinase C alpha type
Synonyms:
KPCA_HUMAN PKC alpha and beta-2 PKC-alpha PRKACA Protein Kinase C- alpha Protein kinase C alpha (PKCa) Protein kinase C alpha type (PRKCA) RAF proto-oncogene serine/threonine-protein kinase
Type:
Enzyme
Mol. Mass.:
76755.65
Organism:
Homo sapiens (Human)
Description:
The recombinant human PKC enzymes were produced using a baculovirus expression system in SF9 cells
Residue:
672
  
Inhibitor
Name:
BDBM50087237
Synonyms:
AutoNom Name: | CHEMBL158666
Type:
Small organic molecule
Emp. Form.:
C23H42O5
Mol. Mass.:
398.5766
SMILES:
CCCCCCCC\C=C\CCCCCCCC(=O)O[C@@H](CO)COC(C)=O
: