Target
Protein kinase C alpha type
Ligand
BDBM50087239
Substrate
Meas. Tech.
ChEBML_160293
Ki
39±n/a nM
Citation
 Nacro, KBienfait, BLewin, NEBlumberg, PMMarquez, VE Diacylglycerols with lipophilically equivalent branched acyl chains display high affinity for protein kinase C (PK-C). A direct measure of the effect of constraining the glycerol backbone in DAG lactones. Bioorg Med Chem Lett 10:653-5 (2000)  
Target
Name:
Protein kinase C alpha type
Synonyms:
KPCA_HUMAN PKC alpha and beta-2 PKC-alpha PRKACA Protein Kinase C- alpha Protein kinase C alpha (PKCa) Protein kinase C alpha type (PRKCA) RAF proto-oncogene serine/threonine-protein kinase
Type:
Enzyme
Mol. Mass.:
76755.65
Organism:
Homo sapiens (Human)
Description:
The recombinant human PKC enzymes were produced using a baculovirus expression system in SF9 cells
Residue:
672
  
Inhibitor
Name:
BDBM50087239
Synonyms:
CHEMBL345343 | Diacylglycerol derivative
Type:
Small organic molecule
Emp. Form.:
C25H36O5
Mol. Mass.:
416.5503
SMILES:
OC[C@@H](COC(=O)C12CC3CC(CC(C3)C1)C2)OC(=O)C12CC3CC(CC(C3)C1)C2
: