Target
Protein kinase C alpha type
Ligand
BDBM50087241
Substrate
Meas. Tech.
ChEBML_160293
Ki
29±n/a nM
Citation
 Nacro, KBienfait, BLewin, NEBlumberg, PMMarquez, VE Diacylglycerols with lipophilically equivalent branched acyl chains display high affinity for protein kinase C (PK-C). A direct measure of the effect of constraining the glycerol backbone in DAG lactones. Bioorg Med Chem Lett 10:653-5 (2000)  
Target
Name:
Protein kinase C alpha type
Synonyms:
KPCA_HUMAN PKC alpha and beta-2 PKC-alpha PRKACA Protein Kinase C- alpha Protein kinase C alpha (PKCa) Protein kinase C alpha type (PRKCA) RAF proto-oncogene serine/threonine-protein kinase
Type:
Enzyme
Mol. Mass.:
76755.65
Organism:
Homo sapiens (Human)
Description:
The recombinant human PKC enzymes were produced using a baculovirus expression system in SF9 cells
Residue:
672
  
Inhibitor
Name:
BDBM50087241
Synonyms:
3-Isopropyl-4-methyl-pentanoic acid (S)-1-hydroxymethyl-2-(3-isopropyl-4-methyl-pentanoyloxy)-ethyl ester 3-Isopropyl-4-methyl-pentanoic acid 3-hydroxy-2-(3-isopropyl-4-methyl-pentanoyloxy)-propyl ester | CHEMBL289230
Type:
Small organic molecule
Emp. Form.:
C21H40O5
Mol. Mass.:
372.5393
SMILES:
CC(C)C(CC(=O)OC[C@H](CO)OC(=O)CC(C(C)C)C(C)C)C(C)C
: