Target
Bifunctional dihydrofolate reductase-thymidylate synthase
Ligand
BDBM50531784
Substrate
Meas. Tech.
ChEMBL_1920944 (CHEMBL4423789)
IC50
1.6±n/a nM
Citation
 Hopper, ATBrockman, AWise, AGould, JBarks, JRadke, JBSibley, LDZou, YThomas, S Discovery of Selective Toxoplasma gondii Dihydrofolate Reductase Inhibitors for the Treatment of Toxoplasmosis. J Med Chem 62:1562-1576 (2019)  
Target
Name:
Bifunctional dihydrofolate reductase-thymidylate synthase
Synonyms:
DHFR-TS Dihydrofolate reductase Dihydrofolate reductase; T. gondii vs rat
Type:
Enzyme
Mol. Mass.:
68757.49
Organism:
Toxoplasma gondii
Description:
Q07422
Residue:
610
  
Inhibitor
Name:
BDBM50531784
Synonyms:
Fanotaprim TRC-2533-NX VYR-006
Type:
Small organic molecule
Emp. Form.:
C19H22N8O
Mol. Mass.:
378.431
SMILES:
COc1ncc(cn1)-c1cccc(c1)N1CCN(CC1)c1cnc(N)nc1N
: