Target
Tyrosine-protein phosphatase non-receptor type 4
Ligand
BDBM50531901
Substrate
Meas. Tech.
ChEMBL_1921368 (CHEMBL4424213)
IC50
5400±n/a nM
Citation
 Buldenko, VMTrush, VVKobzar, OLDrapailo, ABKalchenko, VIVovk, AI Calixarene-based phosphinic acids as inhibitors of protein tyrosine phosphatases. Bioorg Med Chem Lett 29:797-801 (2019)  
Target
Name:
Tyrosine-protein phosphatase non-receptor type 4
Synonyms:
Megakaryocyte protein-tyrosine phosphatase (PTP-MEG2) PTPN4 Tyrosine-protein phosphatase non-receptor type 4 (PTP-MEG1)
Type:
Protein
Mol. Mass.:
105923.44
Organism:
Homo sapiens (Human)
Description:
Residue:
926
  
Inhibitor
Name:
BDBM50531901
Synonyms:
CHEMBL4540813
Type:
Small organic molecule
Emp. Form.:
C52H44O12P4S4
Mol. Mass.:
1113.054
SMILES:
Oc1c2cc(CP(O)(=O)c3ccccc3)cc1sc1cc(CP(O)(=O)c3ccccc3)cc(sc3cc(CP(O)(=O)c4ccccc4)cc(sc4cc(CP(O)(=O)c5ccccc5)cc(s2)c4O)c3O)c1O
: