Target
Tyrosine-protein phosphatase non-receptor type 4
Ligand
BDBM50531902
Substrate
Meas. Tech.
ChEMBL_1921368 (CHEMBL4424213)
IC50
180±n/a nM
Citation
 Buldenko, VMTrush, VVKobzar, OLDrapailo, ABKalchenko, VIVovk, AI Calixarene-based phosphinic acids as inhibitors of protein tyrosine phosphatases. Bioorg Med Chem Lett 29:797-801 (2019)  
Target
Name:
Tyrosine-protein phosphatase non-receptor type 4
Synonyms:
Megakaryocyte protein-tyrosine phosphatase (PTP-MEG2) PTPN4 Tyrosine-protein phosphatase non-receptor type 4 (PTP-MEG1)
Type:
Protein
Mol. Mass.:
105923.44
Organism:
Homo sapiens (Human)
Description:
Residue:
926
  
Inhibitor
Name:
BDBM50531902
Synonyms:
CHEMBL4569405
Type:
Small organic molecule
Emp. Form.:
C52H44O20P4S4
Mol. Mass.:
1241.049
SMILES:
Oc1c2cc(CP(O)(=O)c3ccccc3)cc1S(=O)(=O)c1cc(CP(O)(=O)c3ccccc3)cc(c1O)S(=O)(=O)c1cc(CP(O)(=O)c3ccccc3)cc(c1O)S(=O)(=O)c1cc(CP(O)(=O)c3ccccc3)cc(c1O)S2(=O)=O
: