Target
Fructose-bisphosphate aldolase class 2
Ligand
BDBM50531930
Substrate
Meas. Tech.
ChEMBL_1921621 (CHEMBL4424466)
Ki
2500±n/a nM
Citation
 Xiao, SWei, LHong, ZRao, LRen, YWan, JFeng, L Design, synthesis and algicides activities of thiourea derivatives as the novel scaffold aldolase inhibitors. Bioorg Med Chem 27:805-812 (2019)  
Target
Name:
Fructose-bisphosphate aldolase class 2
Synonyms:
4.1.2.13 FBP aldolase Fructose-1,6-bisphosphate aldolase Fructose-bisphosphate aldolase class II fda | fda
Type:
PROTEIN
Mol. Mass.:
38964.97
Organism:
Synechocystis sp. (strain PCC 6803 / Kazusa)
Description:
ChEMBL_119070
Residue:
359
  
Inhibitor
Name:
BDBM50531930
Synonyms:
CHEMBL4450278
Type:
Small organic molecule
Emp. Form.:
C20H15N3O4S
Mol. Mass.:
393.416
SMILES:
Oc1cc(ccc1NC(=S)NC(=O)c1ccc(cc1)-c1ccccc1)[N+]([O-])=O
: