Target
G protein-activated inward rectifier potassium channel 1
Ligand
BDBM50532007
Substrate
Meas. Tech.
ChEMBL_1921814 (CHEMBL4424659)
EC50
163±n/a nM
Citation
 Sharma, SKozek, KAAbney, KKKumar, SGautam, NAlnouti, YDavid Weaver, CHopkins, CR Discovery, synthesis and characterization of a series of (1-alkyl-3-methyl-1H-pyrazol-5-yl)-2-(5-aryl-2H-tetrazol-2-yl)acetamides as novel GIRK1/2 potassium channel activators. Bioorg Med Chem Lett 29:791-796 (2019)  
Target
Name:
G protein-activated inward rectifier potassium channel 1
Synonyms:
GIRK-1 Inward rectifier K(+) channel Kir3.1 KCNJ3_HUMAN | Potassium channel, inwardly rectifying subfamily J member 3
Type:
PROTEIN
Mol. Mass.:
56610.74
Organism:
Homo sapiens (Human)
Description:
ChEMBL_107915
Residue:
501
  
Inhibitor
Name:
BDBM50532007
Synonyms:
CHEMBL4473433
Type:
Small organic molecule
Emp. Form.:
C18H21N7O
Mol. Mass.:
351.4056
SMILES:
Cc1cc(NC(=O)Cn2nnc(n2)-c2ccccc2)n(n1)C1CCCC1
: