Target
Leukotriene B4 receptor 1
Ligand
BDBM50087682
Substrate
Meas. Tech.
ChEBML_99644
IC50
300±n/a nM
Citation
 Durand, DHullot, PVidal, JPGirard, JPBanères, JLParello, JMuller, ABonne, CRossi, JC Leukotriene B4 photoaffinity probes: design, synthesis and evaluation of new arylazide-1,3-disubstituted cyclohexanes. Bioorg Med Chem Lett 10:811-4 (2000)  
Target
Name:
Leukotriene B4 receptor 1
Synonyms:
BLT BLTR Chemoattractant receptor-like 1 GPR16 LTB4-R 1 Leukotriene B4 R1 Leukotriene B4 receptor 1 P2Y purinoceptor 7 | P2Y7
Type:
Enzyme Catalytic Domain
Mol. Mass.:
37582.68
Organism:
Homo sapiens (Human)
Description:
Q15722
Residue:
352
  
Inhibitor
Name:
BDBM50087682
Synonyms:
CHEMBL354872 | Sodium; [1-hydroxy-3-((E)-3-hydroxy-7-phenyl-hept-1-enyl)-cyclohexyl]-acetate
Type:
Small organic molecule
Emp. Form.:
C21H30O4
Mol. Mass.:
346.4605
SMILES:
OC(CCCCc1ccccc1)\C=C\C1CCCC(O)(CC(O)=O)C1
: