Target
Urease subunit alpha
Ligand
BDBM50099857
Substrate
Meas. Tech.
ChEMBL_1921927 (CHEMBL4424772)
IC50
29200±n/a nM
Citation
 Arshia, naBegum, FAlmandil, NBLodhi, MAKhan, KMHameed, APerveen, S Synthesis and urease inhibitory potential of benzophenone sulfonamide hybrid in vitro and in silico. Bioorg Med Chem 27:1009-1022 (2019)  
Target
Name:
Urease subunit alpha
Synonyms:
3.5.1.5 Urea amidohydrolase subunit alpha | ureC
Type:
PROTEIN
Mol. Mass.:
3418.90
Organism:
Escherichia coli
Description:
ChEMBL_106183
Residue:
30
  
Inhibitor
Name:
BDBM50099857
Synonyms:
ACETOHYDROXAMIC ACID (AHA) Acethydroxamsaeure Acetic acid, oxime Cetohyroxamic acid Methylhydroxamic acid N-Acetylhydroxylamine acetohydroxamic acid
Type:
Small organic molecule
Emp. Form.:
C2H5NO2
Mol. Mass.:
75.0666
SMILES:
CC(=O)NO
: