Target
Urease subunit alpha
Ligand
BDBM50532164
Substrate
Meas. Tech.
ChEMBL_1921927 (CHEMBL4424772)
IC50
13730±n/a nM
Citation
 Arshia, naBegum, FAlmandil, NBLodhi, MAKhan, KMHameed, APerveen, S Synthesis and urease inhibitory potential of benzophenone sulfonamide hybrid in vitro and in silico. Bioorg Med Chem 27:1009-1022 (2019)  
Target
Name:
Urease subunit alpha
Synonyms:
3.5.1.5 Urea amidohydrolase subunit alpha | ureC
Type:
PROTEIN
Mol. Mass.:
3418.90
Organism:
Escherichia coli
Description:
ChEMBL_106183
Residue:
30
  
Inhibitor
Name:
BDBM50532164
Synonyms:
CHEMBL4436232
Type:
Small organic molecule
Emp. Form.:
C19H15N3O5S
Mol. Mass.:
397.405
SMILES:
Oc1ccc(cc1)C(=N\NS(=O)(=O)c1cccc(c1)[N+]([O-])=O)\c1ccccc1
: