Target
Amine oxidase [flavin-containing] A
Ligand
BDBM50087794
Substrate
Meas. Tech.
ChEMBL_123446 (CHEMBL731837)
Ki
4.3±n/a nM
Citation
 Morón, JACampillo, MPerez, VUnzeta, MPardo, L Molecular determinants of MAO selectivity in a series of indolylmethylamine derivatives: biological activities, 3D-QSAR/CoMFA analysis, and computational simulation of ligand recognition. J Med Chem 43:1684-91 (2000)  
Target
Name:
Amine oxidase [flavin-containing] A
Synonyms:
AOFA_RAT Amine oxidase [flavin-containing] A Monoamine Oxidase Type A (MAO-A) Monoamine oxidase A (MAO-A) Monoamine oxidase type A (MAOA)
Type:
Enzyme
Mol. Mass.:
59515.21
Organism:
Rattus norvegicus (rat)
Description:
Residue:
526
  
Inhibitor
Name:
BDBM50087794
Synonyms:
But-2-ynyl-methyl-(1-methyl-1H-indol-2-ylmethyl)-amine (FA30) | CHEMBL416467
Type:
Small organic molecule
Emp. Form.:
C15H18N2
Mol. Mass.:
226.3168
SMILES:
CC#CCN(C)Cc1cc2ccccc2n1C
: