Target
Amine oxidase [flavin-containing] A
Ligand
BDBM50087804
Substrate
Meas. Tech.
ChEMBL_123446 (CHEMBL731837)
Ki
240±n/a nM
Citation
 Morón, JACampillo, MPerez, VUnzeta, MPardo, L Molecular determinants of MAO selectivity in a series of indolylmethylamine derivatives: biological activities, 3D-QSAR/CoMFA analysis, and computational simulation of ligand recognition. J Med Chem 43:1684-91 (2000)  
Target
Name:
Amine oxidase [flavin-containing] A
Synonyms:
AOFA_RAT Amine oxidase [flavin-containing] A Monoamine Oxidase Type A (MAO-A) Monoamine oxidase A (MAO-A) Monoamine oxidase type A (MAOA)
Type:
Enzyme
Mol. Mass.:
59515.21
Organism:
Rattus norvegicus (rat)
Description:
Residue:
526
  
Inhibitor
Name:
BDBM50087804
Synonyms:
(1-Methyl-1H-indol-2-ylmethyl)-prop-2-ynyl-amine | CHEMBL46491
Type:
Small organic molecule
Emp. Form.:
C13H14N2
Mol. Mass.:
198.2637
SMILES:
Cn1c(CNCC#C)cc2ccccc12
: