Target
72 kDa type IV collagenase/Collagenase 3/Interstitial collagenase/Matrix metalloproteinase-9/Neutrophil collagenase
Ligand
BDBM50088107
Substrate
Meas. Tech.
ChEMBL_49490 (CHEMBL662785)
Ki
18±n/a nM
Citation
 Scozzafava, ASupuran, CT Protease inhibitors: synthesis of potent bacterial collagenase and matrix metalloproteinase inhibitors incorporating N-4-nitrobenzylsulfonylglycine hydroxamate moieties. J Med Chem 43:1858-65 (2000)  
Target
Name:
72 kDa type IV collagenase/Collagenase 3/Interstitial collagenase/Matrix metalloproteinase-9/Neutrophil collagenase
Synonyms:
Collagenase
Type:
Mol. Mass.:
Description:
ASSAY_ID of ChEMBL is 49490
Components:
This complex has 5 components.
Component 1
Name:
Matrix metalloproteinase-9
Synonyms:
67 kDa matrix metalloproteinase-9 92 kDa gelatinase CLG4B Gelatinase B MMP9 Matrix metalloproteinase 9 (MMP-9) Matrix metalloproteinase-9 (MMP9)
Type:
Enzyme
Mol. Mass.:
78452.28
Organism:
Homo sapiens (Human)
Description:
P14780
Residue:
707
  
Component 2
Name:
Collagenase 3
Synonyms:
MMP-13 MMP13_HUMAN Matrix metalloproteinase-13 (MMP-13) | Matrix metalloproteinase-13 (MMP13)
Type:
Enzyme
Mol. Mass.:
53808.06
Organism:
Homo sapiens (Human)
Description:
P45452
Residue:
471
  
Component 3
Name:
Interstitial collagenase
Synonyms:
CLG MMP1 Matrix metalloproteinase-1 | Matrix metalloproteinase-1 (MMP-1)
Type:
Enzyme
Mol. Mass.:
54010.26
Organism:
Homo sapiens (Human)
Description:
P03956
Residue:
469
  
Component 4
Name:
72 kDa type IV collagenase
Synonyms:
72 kDa gelatinase CLG4A Gelatinase A (MMP-2) MMP2_HUMAN Matrix metalloproteinase-2 (MMP 2) Matrix metalloproteinases 2 (MMP-2) | TBE-1
Type:
Enzyme
Mol. Mass.:
73870.36
Organism:
Homo sapiens (Human)
Description:
P08253
Residue:
660
  
Component 5
Name:
Neutrophil collagenase
Synonyms:
CLG1 MMP8 Matrix metalloproteinase-8 PMNL collagenase | PMNL-CL
Type:
Enzyme
Mol. Mass.:
53413.48
Organism:
Homo sapiens (Human)
Description:
P22894
Residue:
467
  
Inhibitor
Name:
BDBM50088107
Synonyms:
CHEMBL293357 | N-Hydroxy-2-[(4-nitro-benzyl)-(4-(N-(4-Fluorobenzene)-sulfonyl)ureido-benzenesulfonyl)-amino]-acetamide
Type:
Small organic molecule
Emp. Form.:
C22H20FN5O9S2
Mol. Mass.:
581.551
SMILES:
ONC(=O)CN(Cc1ccc(cc1)[N+]([O-])=O)S(=O)(=O)c1ccc(NC(=O)NS(=O)(=O)c2ccc(F)cc2)cc1
: