Target
Glutamate receptor ionotropic, NMDA 3A
Ligand
BDBM50088145
Substrate
Meas. Tech.
ChEMBL_143326 (CHEMBL752244)
IC50
49000±n/a nM
Citation
 Schelkun, RMYuen, PWSerpa, KMeltzer, LTWise, LDWhittemore, ERWoodward, RM Subtype-selective N-methyl-D-aspartate receptor antagonists: benzimidazalone and hydantoin as phenol replacements. J Med Chem 43:1892-7 (2000)  
Target
Name:
Glutamate receptor ionotropic, NMDA 3A
Synonyms:
Glutamate [NMDA] receptor subunit 3A Grin3a NMDA receptor subunit 3A-1 (GluN3A)
Type:
Protein
Mol. Mass.:
127618.95
Organism:
Rattus norvegicus (Rat)
Description:
Q9R1M7
Residue:
1135
  
Inhibitor
Name:
BDBM50088145
Synonyms:
3-(5-(4-benzylpiperidin-1-yl)pentyl)imidazolidine-2,4-dione CHEMBL442165
Type:
Small organic molecule
Emp. Form.:
C20H29N3O2
Mol. Mass.:
343.4632
SMILES:
Oc1c[nH]c(=O)n1CCCCCN1CCC(Cc2ccccc2)CC1
: