Target
Glutamate receptor ionotropic, NMDA 3A
Ligand
BDBM50088147
Substrate
Meas. Tech.
ChEMBL_143317 (CHEMBL753019)
IC50
>100000±n/a nM
Citation
 Schelkun, RMYuen, PWSerpa, KMeltzer, LTWise, LDWhittemore, ERWoodward, RM Subtype-selective N-methyl-D-aspartate receptor antagonists: benzimidazalone and hydantoin as phenol replacements. J Med Chem 43:1892-7 (2000)  
Target
Name:
Glutamate receptor ionotropic, NMDA 3A
Synonyms:
Glutamate [NMDA] receptor subunit 3A Grin3a NMDA receptor subunit 3A-1 (GluN3A)
Type:
Protein
Mol. Mass.:
127618.95
Organism:
Rattus norvegicus (Rat)
Description:
Q9R1M7
Residue:
1135
  
Inhibitor
Name:
BDBM50088147
Synonyms:
3-[4-(4-Benzyl-piperidin-1-yl)-butyl]-imidazolidine-2,4-dione | CHEMBL58826
Type:
Small organic molecule
Emp. Form.:
C19H27N3O2
Mol. Mass.:
329.4366
SMILES:
Oc1c[nH]c(=O)n1CCCCN1CCC(Cc2ccccc2)CC1
: