Target
Carbonic anhydrase 12
Ligand
BDBM29278
Substrate
Meas. Tech.
ChEMBL_1923160 (CHEMBL4426116)
Ki
633±n/a nM
Citation
 Coviello, VMarchi, BSartini, SQuattrini, LMarini, AMSimorini, FTaliani, SSalerno, SOrlandi, PFioravanti, ADesidero, TDVullo, DDa Settimo, FSupuran, CTBocci, GLa Motta, C 1,2-Benzisothiazole Derivatives Bearing 4-, 5-, or 6-Alkyl/arylcarboxamide Moieties Inhibit Carbonic Anhydrase Isoform IX (CAIX) and Cell Proliferation under Hypoxic Conditions. J Med Chem 59:6547-52 (2016)  
Target
Name:
Carbonic anhydrase 12
Synonyms:
CA-XII CAH12_HUMAN Carbonic anhydrase Carbonic anhydrase XII Carbonic anhydrase XII (CAXII) | Tumor antigen HOM-RCC-3.1.3
Type:
Enzyme
Mol. Mass.:
39456.00
Organism:
Homo sapiens (Human)
Description:
Catalytic domain of human cloned isozyme was used in the assay
Residue:
354
  
Inhibitor
Name:
BDBM29278
Synonyms:
CHEMBL310671 SAC Saccharin
Type:
Small organic molecule
Emp. Form.:
C7H5NO3S
Mol. Mass.:
183.185
SMILES:
O=C1NS(=O)(=O)c2ccccc12
: