Target
Endothelin-1 receptor
Ligand
BDBM50124446
Substrate
Meas. Tech.
ChEMBL_1923367 (CHEMBL4426323)
IC50
22±n/a nM
Citation
 Boss, CBolli, MHGatfield, J From bosentan (TracleerŪ) to macitentan (OpsumitŪ): The medicinal chemistry perspective. Bioorg Med Chem Lett 26:3381-94 (2016)  
Target
Name:
Endothelin-1 receptor
Synonyms:
EDNRA ET-A ETA-R Endothelin receptor type A hET-AR
Type:
Enzyme Catalytic Domain
Mol. Mass.:
48736.88
Organism:
Homo sapiens (Human)
Description:
P25101
Residue:
427
  
Inhibitor
Name:
BDBM50124446
Synonyms:
5-Isopropyl-pyridine-2-sulfonic acid {2-cyclopropyl-5-(2-methoxy-phenoxy)-6-[3-(thiophene-2-sulfonylamino)-propoxy]-pyrimidin-4-yl}-amide | CHEMBL367444
Type:
Small organic molecule
Emp. Form.:
C29H33N5O7S3
Mol. Mass.:
659.797
SMILES:
COc1ccccc1Oc1c(NS(=O)(=O)c2ccc(cn2)C(C)C)nc(nc1OCCCNS(=O)(=O)c1cccs1)C1CC1
: