Target
Endothelin receptor type B
Ligand
BDBM50124446
Substrate
Meas. Tech.
ChEMBL_1923368 (CHEMBL4426324)
IC50
4.0±n/a nM
Citation
 Boss, CBolli, MHGatfield, J From bosentan (TracleerŪ) to macitentan (OpsumitŪ): The medicinal chemistry perspective. Bioorg Med Chem Lett 26:3381-94 (2016)  
Target
Name:
Endothelin receptor type B
Synonyms:
EDNRB ENDOTHELIN B ETRB Endothelin receptor non-selective type | Endothelin receptor, ET-A/ET-B
Type:
Enzyme Catalytic Domain
Mol. Mass.:
49664.00
Organism:
Homo sapiens (Human)
Description:
ENDOTHELIN B EDNRB HUMAN::P24530
Residue:
442
  
Inhibitor
Name:
BDBM50124446
Synonyms:
5-Isopropyl-pyridine-2-sulfonic acid {2-cyclopropyl-5-(2-methoxy-phenoxy)-6-[3-(thiophene-2-sulfonylamino)-propoxy]-pyrimidin-4-yl}-amide | CHEMBL367444
Type:
Small organic molecule
Emp. Form.:
C29H33N5O7S3
Mol. Mass.:
659.797
SMILES:
COc1ccccc1Oc1c(NS(=O)(=O)c2ccc(cn2)C(C)C)nc(nc1OCCCNS(=O)(=O)c1cccs1)C1CC1
: