Target
Cyclin-C
Ligand
BDBM50532621
Substrate
Meas. Tech.
ChEMBL_1923379 (CHEMBL4426335)
IC50
166±n/a nM
Citation
 Bergeron, PKoehler, MFBlackwood, EMBowman, KClark, KFirestein, RKiefer, JRMaskos, KMcCleland, MLOrren, LRamaswamy, SSalphati, LSchmidt, SSchneider, EVWu, JBeresini, M Design and Development of a Series of Potent and Selective Type II Inhibitors of CDK8. ACS Med Chem Lett 7:595-600 (2016)  
Target
Name:
Cyclin-C
Synonyms:
CCNC Cyclin C hSRB11
Type:
PROTEIN
Mol. Mass.:
33244.88
Organism:
Homo sapiens (Human)
Description:
ChEMBL_107900
Residue:
283
  
Inhibitor
Name:
BDBM50532621
Synonyms:
CHEMBL4556479
Type:
Small organic molecule
Emp. Form.:
C17H15ClF3N7O
Mol. Mass.:
425.796
SMILES:
FC(F)(F)c1cc(NC(=O)N[C@@H]2CCN(C2)c2ccc3nncn3n2)ccc1Cl
: