Target
Cyclin-C
Ligand
BDBM50532623
Substrate
Meas. Tech.
ChEMBL_1923379 (CHEMBL4426335)
IC50
18±n/a nM
Citation
 Bergeron, PKoehler, MFBlackwood, EMBowman, KClark, KFirestein, RKiefer, JRMaskos, KMcCleland, MLOrren, LRamaswamy, SSalphati, LSchmidt, SSchneider, EVWu, JBeresini, M Design and Development of a Series of Potent and Selective Type II Inhibitors of CDK8. ACS Med Chem Lett 7:595-600 (2016)  
Target
Name:
Cyclin-C
Synonyms:
CCNC Cyclin C hSRB11
Type:
PROTEIN
Mol. Mass.:
33244.88
Organism:
Homo sapiens (Human)
Description:
ChEMBL_107900
Residue:
283
  
Inhibitor
Name:
BDBM50532623
Synonyms:
CHEMBL4530828
Type:
Small organic molecule
Emp. Form.:
C17H21ClN6O
Mol. Mass.:
360.841
SMILES:
CNc1nccc(n1)N1CC[C@@H](C1)NC(=O)Nc1ccc(C)c(Cl)c1
: