Target
Fibroblast growth factor receptor 1
Ligand
BDBM434568
Substrate
Meas. Tech.
ChEMBL_1923448 (CHEMBL4426404)
IC50
0.500000±n/a nM
Citation
 Zhao, BLi, YXu, PDai, YLuo, CSun, YAi, JGeng, MDuan, W Discovery of Substituted 1H-Pyrazolo[3,4-b]pyridine Derivatives as Potent and Selective FGFR Kinase Inhibitors. ACS Med Chem Lett 7:629-34 (2016)  
Target
Name:
Fibroblast growth factor receptor 1
Synonyms:
BFGFR Basic fibroblast growth factor receptor 1 (FGFR1) CEK FGFR-1 FGFR-1, (FL) FGFR1_HUMAN FLT2 Fibroblast growth factor receptor 1 (FGFR-1) Fms-like tyrosine kinase 2 N-sam bFGF-R | c-fgr
Type:
Receptor
Mol. Mass.:
91861.70
Organism:
Homo sapiens (Human)
Description:
P11362
Residue:
822
  
Inhibitor
Name:
BDBM434568
Synonyms:
US10562900, Example 65
Type:
Small organic molecule
Emp. Form.:
C27H28Cl2N6O3
Mol. Mass.:
555.456
SMILES:
CCN1CCN(CC1)c1ccc(cc1)C(=O)Nc1n[nH]c2nc(ccc12)-c1c(Cl)c(OC)cc(OC)c1Cl
: