Target
Fibroblast growth factor receptor 3
Ligand
BDBM50532673
Substrate
Meas. Tech.
ChEMBL_1923462 (CHEMBL4426418)
IC50
2.0±n/a nM
Citation
 Zhao, BLi, YXu, PDai, YLuo, CSun, YAi, JGeng, MDuan, W Discovery of Substituted 1H-Pyrazolo[3,4-b]pyridine Derivatives as Potent and Selective FGFR Kinase Inhibitors. ACS Med Chem Lett 7:629-34 (2016)  
Target
Name:
Fibroblast growth factor receptor 3
Synonyms:
CD_antigen: CD333 FGFR3 Fibroblast growth factor receptor JTK4
Type:
Protein
Mol. Mass.:
87699.57
Organism:
Homo sapiens (Human)
Description:
P22607
Residue:
806
  
Inhibitor
Name:
BDBM50532673
Synonyms:
CHEMBL4447359
Type:
Small organic molecule
Emp. Form.:
C28H30Cl2N6O4
Mol. Mass.:
585.482
SMILES:
COCCN1CCN(CC1)c1ccc(cc1)C(=O)Nc1n[nH]c2nc(ccc12)-c1c(Cl)c(OC)cc(OC)c1Cl
: