Target
Fibroblast growth factor receptor 1
Ligand
BDBM434537
Substrate
Meas. Tech.
ChEMBL_1923448 (CHEMBL4426404)
IC50
3.3±n/a nM
Citation
 Zhao, BLi, YXu, PDai, YLuo, CSun, YAi, JGeng, MDuan, W Discovery of Substituted 1H-Pyrazolo[3,4-b]pyridine Derivatives as Potent and Selective FGFR Kinase Inhibitors. ACS Med Chem Lett 7:629-34 (2016)  
Target
Name:
Fibroblast growth factor receptor 1
Synonyms:
BFGFR Basic fibroblast growth factor receptor 1 (FGFR1) CEK FGFR-1 FGFR-1, (FL) FGFR1_HUMAN FLT2 Fibroblast growth factor receptor 1 (FGFR-1) Fms-like tyrosine kinase 2 N-sam bFGF-R | c-fgr
Type:
Receptor
Mol. Mass.:
91861.70
Organism:
Homo sapiens (Human)
Description:
P11362
Residue:
822
  
Inhibitor
Name:
BDBM434537
Synonyms:
US10562900, Example 15
Type:
Small organic molecule
Emp. Form.:
C27H27Cl2N5O3
Mol. Mass.:
540.441
SMILES:
COc1cc(OC)c(Cl)c(-c2ccc3c(NC(=O)c4ccc(cc4)N4CCN(C)CC4)n[nH]c3c2)c1Cl
: