Target
Fibroblast growth factor receptor 3
Ligand
BDBM50065454
Substrate
Meas. Tech.
ChEMBL_1923462 (CHEMBL4426418)
IC50
5.6±n/a nM
Citation
 Zhao, BLi, YXu, PDai, YLuo, CSun, YAi, JGeng, MDuan, W Discovery of Substituted 1H-Pyrazolo[3,4-b]pyridine Derivatives as Potent and Selective FGFR Kinase Inhibitors. ACS Med Chem Lett 7:629-34 (2016)  
Target
Name:
Fibroblast growth factor receptor 3
Synonyms:
CD_antigen: CD333 FGFR3 Fibroblast growth factor receptor JTK4
Type:
Protein
Mol. Mass.:
87699.57
Organism:
Homo sapiens (Human)
Description:
P22607
Residue:
806
  
Inhibitor
Name:
BDBM50065454
Synonyms:
CHEBI:63453 | CHEMBL3348846
Type:
Small organic molecule
Emp. Form.:
C26H33N5O3
Mol. Mass.:
463.5719
SMILES:
COc1cc(CCc2cc(NC(=O)c3ccc(cc3)N3C[C@H](C)N[C@H](C)C3)n[nH]2)cc(OC)c1
: