Target
Fibroblast growth factor receptor 1
Ligand
BDBM50532684
Substrate
Meas. Tech.
ChEMBL_1923448 (CHEMBL4426404)
IC50
0.200000±n/a nM
Citation
 Zhao, BLi, YXu, PDai, YLuo, CSun, YAi, JGeng, MDuan, W Discovery of Substituted 1H-Pyrazolo[3,4-b]pyridine Derivatives as Potent and Selective FGFR Kinase Inhibitors. ACS Med Chem Lett 7:629-34 (2016)  
Target
Name:
Fibroblast growth factor receptor 1
Synonyms:
BFGFR Basic fibroblast growth factor receptor 1 (FGFR1) CEK FGFR-1 FGFR-1, (FL) FGFR1_HUMAN FLT2 Fibroblast growth factor receptor 1 (FGFR-1) Fms-like tyrosine kinase 2 N-sam bFGF-R | c-fgr
Type:
Receptor
Mol. Mass.:
91861.70
Organism:
Homo sapiens (Human)
Description:
P11362
Residue:
822
  
Inhibitor
Name:
BDBM50532684
Synonyms:
CHEMBL4542061
Type:
Small organic molecule
Emp. Form.:
C26H26Cl2N6O5S
Mol. Mass.:
605.493
SMILES:
COc1cc(OC)c(Cl)c(c1Cl)-c1ccc2c(NC(=O)c3ccc(cc3)N3CCN(CC3)S(C)(=O)=O)n[nH]c2n1
: