Target
Fibroblast growth factor receptor 1
Ligand
BDBM50532679
Substrate
Meas. Tech.
ChEMBL_1923448 (CHEMBL4426404)
IC50
3.9±n/a nM
Citation
 Zhao, BLi, YXu, PDai, YLuo, CSun, YAi, JGeng, MDuan, W Discovery of Substituted 1H-Pyrazolo[3,4-b]pyridine Derivatives as Potent and Selective FGFR Kinase Inhibitors. ACS Med Chem Lett 7:629-34 (2016)  
Target
Name:
Fibroblast growth factor receptor 1
Synonyms:
BFGFR Basic fibroblast growth factor receptor 1 (FGFR1) CEK FGFR-1 FGFR-1, (FL) FGFR1_HUMAN FLT2 Fibroblast growth factor receptor 1 (FGFR-1) Fms-like tyrosine kinase 2 N-sam bFGF-R | c-fgr
Type:
Receptor
Mol. Mass.:
91861.70
Organism:
Homo sapiens (Human)
Description:
P11362
Residue:
822
  
Inhibitor
Name:
BDBM50532679
Synonyms:
CHEMBL4559114
Type:
Small organic molecule
Emp. Form.:
C26H28Cl2N6O3
Mol. Mass.:
543.445
SMILES:
COc1cc(OC)c(Cl)c(c1Cl)-c1ccc2c(NC(=O)c3ccc(cc3)N(C)CCN(C)C)n[nH]c2n1
: