Target
Fibroblast growth factor receptor 2
Ligand
BDBM50532673
Substrate
Meas. Tech.
ChEMBL_1923461 (CHEMBL4426417)
IC50
0.700000±n/a nM
Citation
 Zhao, BLi, YXu, PDai, YLuo, CSun, YAi, JGeng, MDuan, W Discovery of Substituted 1H-Pyrazolo[3,4-b]pyridine Derivatives as Potent and Selective FGFR Kinase Inhibitors. ACS Med Chem Lett 7:629-34 (2016)  
Target
Name:
Fibroblast growth factor receptor 2
Synonyms:
BEK FGFR-2 FGFR2 Fibroblast growth factor receptor 2 (FGFR2) KGFR Keratinocyte growth factor receptor VEGF-receptor 2 and Fibroblast growth factor receptor 2
Type:
Enzyme
Mol. Mass.:
92015.45
Organism:
Homo sapiens (Human)
Description:
P21802
Residue:
821
  
Inhibitor
Name:
BDBM50532673
Synonyms:
CHEMBL4447359
Type:
Small organic molecule
Emp. Form.:
C28H30Cl2N6O4
Mol. Mass.:
585.482
SMILES:
COCCN1CCN(CC1)c1ccc(cc1)C(=O)Nc1n[nH]c2nc(ccc12)-c1c(Cl)c(OC)cc(OC)c1Cl
: