Target
Diacylglycerol lipase-alpha
Ligand
BDBM434879
Substrate
Meas. Tech.
ChEMBL_1924058 (CHEMBL4427014)
IC50
0.501187±n/a nM
Citation
 Janssen, FJvan der Stelt, M Inhibitors of diacylglycerol lipases in neurodegenerative and metabolic disorders. Bioorg Med Chem Lett 26:3831-7 (2016)  
Target
Name:
Diacylglycerol lipase-alpha
Synonyms:
C11orf11 DGLA_HUMAN NSDDR | Sn1-specific diacylglycerol lipase alpha
Type:
PROTEIN
Mol. Mass.:
114947.74
Organism:
Homo sapiens (Human)
Description:
ChEMBL_1449471
Residue:
1042
  
Inhibitor
Name:
BDBM434879
Synonyms:
US10583137, Compound 17 | tert-Butyl 3-benzyl-4-(4-(4-(trifluoromethoxy)phenyl)-1H-1,2,3-triazole-1-carbonyl)piperazine-1-carboxylate
Type:
Small organic molecule
Emp. Form.:
C26H28F3N5O4
Mol. Mass.:
531.5268
SMILES:
CC(C)(C)OC(=O)N1CCN(C(Cc2ccccc2)C1)C(=O)n1cc(nn1)-c1ccc(OC(F)(F)F)cc1
: