Target
Hexokinase-4
Ligand
BDBM50533157
Substrate
Meas. Tech.
ChEMBL_1924594 (CHEMBL4427550)
EC50
1230±n/a nM
Citation
 Dransfield, PJPattaropong, VLai, SFu, ZKohn, TJDu, XCheng, AXiong, YKomorowski, RJin, LConn, MTien, EDeWolf, WEHinklin, RJAicher, TDKraser, CFBoyd, SAVoegtli, WCCondroski, KRVeniant-Ellison, MMedina, JCHouze, JCoward, P Novel Series of Potent Glucokinase Activators Leading to the Discovery of AM-2394. ACS Med Chem Lett 7:714-8 (2016)  
Target
Name:
Hexokinase-4
Synonyms:
GCK Glucokinase (GK) HK IV HXK4_HUMAN Hexokinase-D
Type:
Enzyme
Mol. Mass.:
52175.81
Organism:
Homo sapiens (Human)
Description:
P35557
Residue:
465
  
Inhibitor
Name:
BDBM50533157
Synonyms:
CHEMBL4561645
Type:
Small organic molecule
Emp. Form.:
C16H15F2N3O2
Mol. Mass.:
319.306
SMILES:
CNC(=O)Nc1cc(Oc2c(F)cccc2F)c(cn1)C1CC1
: