Target
Hexokinase-4
Ligand
BDBM50533174
Substrate
Meas. Tech.
ChEMBL_1924593 (CHEMBL4427549)
EC50
300±n/a nM
Citation
 Dransfield, PJPattaropong, VLai, SFu, ZKohn, TJDu, XCheng, AXiong, YKomorowski, RJin, LConn, MTien, EDeWolf, WEHinklin, RJAicher, TDKraser, CFBoyd, SAVoegtli, WCCondroski, KRVeniant-Ellison, MMedina, JCHouze, JCoward, P Novel Series of Potent Glucokinase Activators Leading to the Discovery of AM-2394. ACS Med Chem Lett 7:714-8 (2016)  
Target
Name:
Hexokinase-4
Synonyms:
GCK Glucokinase (GK) HK IV HXK4_HUMAN Hexokinase-D
Type:
Enzyme
Mol. Mass.:
52175.81
Organism:
Homo sapiens (Human)
Description:
P35557
Residue:
465
  
Inhibitor
Name:
BDBM50533174
Synonyms:
CHEMBL4538137
Type:
Small organic molecule
Emp. Form.:
C13H11ClFN3O2
Mol. Mass.:
295.697
SMILES:
CNC(=O)Nc1cc(Oc2cccc(Cl)c2F)ccn1
: