Target
Hexokinase-4
Ligand
BDBM50533162
Substrate
Meas. Tech.
ChEMBL_1924593 (CHEMBL4427549)
EC50
500±n/a nM
Citation
 Dransfield, PJPattaropong, VLai, SFu, ZKohn, TJDu, XCheng, AXiong, YKomorowski, RJin, LConn, MTien, EDeWolf, WEHinklin, RJAicher, TDKraser, CFBoyd, SAVoegtli, WCCondroski, KRVeniant-Ellison, MMedina, JCHouze, JCoward, P Novel Series of Potent Glucokinase Activators Leading to the Discovery of AM-2394. ACS Med Chem Lett 7:714-8 (2016)  
Target
Name:
Hexokinase-4
Synonyms:
GCK Glucokinase (GK) HK IV HXK4_HUMAN Hexokinase-D
Type:
Enzyme
Mol. Mass.:
52175.81
Organism:
Homo sapiens (Human)
Description:
P35557
Residue:
465
  
Inhibitor
Name:
BDBM50533162
Synonyms:
CHEMBL4574225
Type:
Small organic molecule
Emp. Form.:
C19H19N5O4
Mol. Mass.:
381.3853
SMILES:
CNC(=O)Nc1cc(Oc2cccnc2)c(cn1)-c1ccc(OCCO)nc1
: