Target
Beta-lactamase
Ligand
BDBM50088813
Substrate
Meas. Tech.
ChEMBL_41361 (CHEMBL656040)
IC50
91100±n/a nM
Citation
 Buynak, JDDoppalapudi, VRRao, ASNidamarthy, SDAdam, G The synthesis and evaluation of 2-substituted-7-(alkylidene)cephalosporin sulfones as beta-lactamase inhibitors. Bioorg Med Chem Lett 10:847-51 (2000)  
Target
Name:
Beta-lactamase
Synonyms:
BLAC_STAAU Penicillinase | blaZ
Type:
PROTEIN
Mol. Mass.:
31367.53
Organism:
Staphylococcus aureus
Description:
ChEMBL_41052
Residue:
281
  
Inhibitor
Name:
BDBM50088813
Synonyms:
CHEMBL166730 | Sodium; (R)-3-methyl-4-methylene-5,5,8-trioxo-7-[1-pyridin-2-yl-meth-(Z)-ylidene]-5lambda*6*-thia-1-aza-bicyclo[4.2.0]oct-2-ene-2-carboxylate
Type:
Small organic molecule
Emp. Form.:
C15H11N2O5S
Mol. Mass.:
331.324
SMILES:
CC1=C(N2[C@@H](\C(=C/c3ccccn3)C2=O)S(=O)(=O)C1=C)C([O-])=O
: