Target
Beta-lactamase
Ligand
BDBM50088810
Substrate
Meas. Tech.
ChEBML_47848
IC50
165±n/a nM
Citation
 Buynak, JDDoppalapudi, VRRao, ASNidamarthy, SDAdam, G The synthesis and evaluation of 2-substituted-7-(alkylidene)cephalosporin sulfones as beta-lactamase inhibitors. Bioorg Med Chem Lett 10:847-51 (2000)  
Target
Name:
Beta-lactamase
Synonyms:
Beta-lactamase class C
Type:
PROTEIN
Mol. Mass.:
41618.07
Organism:
Enterobacter cloacae
Description:
ChEMBL_47855
Residue:
384
  
Inhibitor
Name:
BDBM50088810
Synonyms:
CHEMBL353004 | Sodium; (R)-3-acetoxymethyl-4-methylene-5,5,8-trioxo-7-[1-pyridin-2-yl-meth-(Z)-ylidene]-5lambda*6*-thia-1-aza-bicyclo[4.2.0]oct-2-ene-2-carboxylate
Type:
Small organic molecule
Emp. Form.:
C17H13N2O7S
Mol. Mass.:
389.36
SMILES:
CC(=O)OCC1=C(N2[C@@H](\C(=C/c3ccccn3)C2=O)S(=O)(=O)C1=C)C([O-])=O
: