Target
Beta-lactamase
Ligand
BDBM50088836
Substrate
Meas. Tech.
ChEBML_47849
IC50
260±n/a nM
Citation
 Buynak, JDDoppalapudi, VRAdam, G The synthesis and evaluation of 3-substituted-7-(alkylidene)cephalosporin sulfones as beta-lactamase inhibitors. Bioorg Med Chem Lett 10:853-7 (2000)  
Target
Name:
Beta-lactamase
Synonyms:
Beta-lactamase class C
Type:
PROTEIN
Mol. Mass.:
41618.07
Organism:
Enterobacter cloacae
Description:
ChEMBL_47855
Residue:
384
  
Inhibitor
Name:
BDBM50088836
Synonyms:
CHEMBL354758 | Sodium; 3-carbamoyloxymethyl-5,5,8-trioxo-7-[1-pyridin-2-yl-meth-(Z)-ylidene]-5lambda*6*-thia-1-aza-bicyclo[4.2.0]oct-2-ene-2-carboxylate
Type:
Small organic molecule
Emp. Form.:
C15H12N3O7S
Mol. Mass.:
378.337
SMILES:
NC(=O)OCC1=C(N2C(C(=Cc3ccccn3)C2=O)S(=O)(=O)C1)C([O-])=O
: