Target
Beta-lactamase
Ligand
BDBM50088832
Substrate
Meas. Tech.
ChEMBL_47850 (CHEMBL660938)
IC50
400±n/a nM
Citation
 Buynak, JDDoppalapudi, VRAdam, G The synthesis and evaluation of 3-substituted-7-(alkylidene)cephalosporin sulfones as beta-lactamase inhibitors. Bioorg Med Chem Lett 10:853-7 (2000)  
Target
Name:
Beta-lactamase
Synonyms:
Beta-lactamase class C
Type:
PROTEIN
Mol. Mass.:
41618.07
Organism:
Enterobacter cloacae
Description:
ChEMBL_47855
Residue:
384
  
Inhibitor
Name:
BDBM50088832
Synonyms:
CHEMBL171049 | Sodium; 3-ethoxycarbonylmethylcarbamoyloxymethyl-5,5,8-trioxo-7-[1-pyridin-2-yl-meth-(Z)-ylidene]-5lambda*6*-thia-1-aza-bicyclo[4.2.0]oct-2-ene-2-carboxylate
Type:
Small organic molecule
Emp. Form.:
C19H18N3O9S
Mol. Mass.:
464.426
SMILES:
CCOC(=O)CNC(=O)OCC1=C(N2C(C(=Cc3ccccn3)C2=O)S(=O)(=O)C1)C([O-])=O
: