Target
Beta-lactamase
Ligand
BDBM50088828
Substrate
Meas. Tech.
ChEMBL_47850 (CHEMBL660938)
IC50
900±n/a nM
Citation
 Buynak, JDDoppalapudi, VRAdam, G The synthesis and evaluation of 3-substituted-7-(alkylidene)cephalosporin sulfones as beta-lactamase inhibitors. Bioorg Med Chem Lett 10:853-7 (2000)  
Target
Name:
Beta-lactamase
Synonyms:
Beta-lactamase class C
Type:
PROTEIN
Mol. Mass.:
41618.07
Organism:
Enterobacter cloacae
Description:
ChEMBL_47855
Residue:
384
  
Inhibitor
Name:
BDBM50088828
Synonyms:
CHEMBL169550 | Sodium; 3-cyanomethyl-5,5,8-trioxo-7-[1-pyridin-2-yl-meth-(Z)-ylidene]-5lambda*6*-thia-1-aza-bicyclo[4.2.0]oct-2-ene-2-carboxylate
Type:
Small organic molecule
Emp. Form.:
C15H10N3O5S
Mol. Mass.:
344.323
SMILES:
[O-]C(=O)C1=C(CC#N)CS(=O)(=O)C2N1C(=O)\C2=C\c1ccccn1
: