Target
Beta-lactamase
Ligand
BDBM50088821
Substrate
Meas. Tech.
ChEMBL_47850 (CHEMBL660938)
IC50
290±n/a nM
Citation
 Buynak, JDDoppalapudi, VRAdam, G The synthesis and evaluation of 3-substituted-7-(alkylidene)cephalosporin sulfones as beta-lactamase inhibitors. Bioorg Med Chem Lett 10:853-7 (2000)  
Target
Name:
Beta-lactamase
Synonyms:
Beta-lactamase class C
Type:
PROTEIN
Mol. Mass.:
41618.07
Organism:
Enterobacter cloacae
Description:
ChEMBL_47855
Residue:
384
  
Inhibitor
Name:
BDBM50088821
Synonyms:
CHEMBL353694 | Sodium; 3-((E)-2-carbamoyl-vinyl)-5,5,8-trioxo-7-[1-thiophen-2-yl-meth-(Z)-ylidene]-5lambda*6*-thia-1-aza-bicyclo[4.2.0]oct-2-ene-2-carboxylate
Type:
Small organic molecule
Emp. Form.:
C15H11N2O6S2
Mol. Mass.:
379.388
SMILES:
NC(=O)\C=C\C1=C(N2C(\C(=C/c3cccs3)C2=O)S(=O)(=O)C1)C([O-])=O
: