Target
Carbonic anhydrase 2
Ligand
BDBM50028010
Substrate
Meas. Tech.
ChEMBL_1925023 (CHEMBL4427979)
Ki
35±n/a nM
Citation
 Del Prete, SVullo, DDe Luca, VCarginale, VOsman, SMAlOthman, ZSupuran, CTCapasso, C Cloning, expression, purification and sulfonamide inhibition profile of the complete domain of the ?-carbonic anhydrase from Plasmodium falciparum. Bioorg Med Chem Lett 26:4184-90 (2016)  
Target
Name:
Carbonic anhydrase 2
Synonyms:
CA-II CAC Carbonate dehydratase II Carbonic anhydrase 2 (CA-II) Carbonic anhydrase C Carbonic anhydrase II (CA-II) Carbonic anhydrase II (hCA II) | Carbonic anhydrase isoenzyme II (hCA II)
Type:
Enzyme
Mol. Mass.:
29250.71
Organism:
Homo sapiens (Human)
Description:
P00918
Residue:
260
  
Inhibitor
Name:
BDBM50028010
Synonyms:
AD-810 CI-912 Zonegran | Zonisamide
Type:
Small organic molecule
Emp. Form.:
C8H8N2O3S
Mol. Mass.:
212.226
SMILES:
OS(=N)(=O)Cc1noc2ccccc12
: