Target
Neuropeptide Y receptor type 2
Ligand
BDBM50089038
Substrate
Meas. Tech.
ChEBML_143844
IC50
1890±n/a nM
Citation
 Rueeger, HRigollier, PYamaguchi, YSchmidlin, TSchilling, WCriscione, LWhitebread, SChiesi, MWalker, MWDhanoa, DIslam, IZhang, JGluchowski, C Design, synthesis and SAR of a series of 2-substituted 4-amino-quinazoline neuropeptide Y Y5 receptor antagonists. Bioorg Med Chem Lett 10:1175-9 (2000)  
Target
Name:
Neuropeptide Y receptor type 2
Synonyms:
NPY-Y2 NPY2-R NPY2R_HUMAN Y2 receptor | neuropeptide Y receptor Y2
Type:
Enzyme Catalytic Domain
Mol. Mass.:
42734.65
Organism:
Homo sapiens (Human)
Description:
NPY-Y2 NPY2R HUMAN::P49146
Residue:
381
  
Inhibitor
Name:
BDBM50089038
Synonyms:
CGP 71683 CHEMBL17645 Naphthalene-1-sulfonic acid {4-[(4-amino-quinazolin-2-ylamino)-methyl]-cyclohexylmethyl}-amide
Type:
Small organic molecule
Emp. Form.:
C26H29N5O2S
Mol. Mass.:
475.606
SMILES:
Nc1nc(NC[C@H]2CC[C@H](CNS(=O)(=O)c3cccc4ccccc34)CC2)nc2ccccc12
: