Target
Neuropeptide Y receptor type 5
Ligand
BDBM50089042
Substrate
Meas. Tech.
ChEBML_143988
IC50
390±n/a nM
Citation
 Rueeger, HRigollier, PYamaguchi, YSchmidlin, TSchilling, WCriscione, LWhitebread, SChiesi, MWalker, MWDhanoa, DIslam, IZhang, JGluchowski, C Design, synthesis and SAR of a series of 2-substituted 4-amino-quinazoline neuropeptide Y Y5 receptor antagonists. Bioorg Med Chem Lett 10:1175-9 (2000)  
Target
Name:
Neuropeptide Y receptor type 5
Synonyms:
NPY-Y5 NPY5-R NPY5R_HUMAN NPYY5 Neuropeptide Y receptor type 5 ( NPY Y5) | Y5 receptor
Type:
Enzyme
Mol. Mass.:
50746.64
Organism:
Homo sapiens (Human)
Description:
Q15761
Residue:
445
  
Inhibitor
Name:
BDBM50089042
Synonyms:
CHEMBL17398 | N-{4-[4-(4-Chloro-phenylamino)-quinazolin-2-ylamino]-cyclohexylmethyl}-acetamide
Type:
Small organic molecule
Emp. Form.:
C23H26ClN5O
Mol. Mass.:
423.938
SMILES:
CC(=O)NC[C@H]1CC[C@@H](CC1)Nc1nc(Nc2ccc(Cl)cc2)c2ccccc2n1
: