Target
Neuropeptide Y receptor type 5
Ligand
BDBM50089064
Substrate
Meas. Tech.
ChEBML_143988
IC50
710±n/a nM
Citation
 Rueeger, HRigollier, PYamaguchi, YSchmidlin, TSchilling, WCriscione, LWhitebread, SChiesi, MWalker, MWDhanoa, DIslam, IZhang, JGluchowski, C Design, synthesis and SAR of a series of 2-substituted 4-amino-quinazoline neuropeptide Y Y5 receptor antagonists. Bioorg Med Chem Lett 10:1175-9 (2000)  
Target
Name:
Neuropeptide Y receptor type 5
Synonyms:
NPY-Y5 NPY5-R NPY5R_HUMAN NPYY5 Neuropeptide Y receptor type 5 ( NPY Y5) | Y5 receptor
Type:
Enzyme
Mol. Mass.:
50746.64
Organism:
Homo sapiens (Human)
Description:
Q15761
Residue:
445
  
Inhibitor
Name:
BDBM50089064
Synonyms:
CHEMBL275845 | Naphthalene-1-sulfonic acid (4-{[(4-amino-quinazolin-2-yl)-methyl-amino]-methyl}-cyclohexylmethyl)-methyl-amide
Type:
Small organic molecule
Emp. Form.:
C28H33N5O2S
Mol. Mass.:
503.659
SMILES:
CN(C[C@H]1CC[C@H](CN(C)S(=O)(=O)c2cccc3ccccc23)CC1)c1nc(N)c2ccccc2n1
: