Target
Proprotein convertase subtilisin/kexin type 7
Ligand
BDBM50533413
Substrate
Meas. Tech.
ChEMBL_1925262 (CHEMBL4428334)
Ki
0.120000±n/a nM
Citation
 Kumar, RJuillerat-Jeanneret, LGolshayan, D Notch Antagonists: Potential Modulators of Cancer and Inflammatory Diseases. J Med Chem 59:7719-37 (2016)  
Target
Name:
Proprotein convertase subtilisin/kexin type 7
Synonyms:
LPC PC7 PCSK7 Prohormone convertase PC7 Proprotein convertase subtilisin/kexin type 7 Subtilisin/kexin type 7 hPC8
Type:
PROTEIN
Mol. Mass.:
86233.43
Organism:
Homo sapiens (Human)
Description:
ChEMBL_1290739
Residue:
785
  
Inhibitor
Name:
BDBM50533413
Synonyms:
CHEMBL3126388
Type:
Small organic molecule
Emp. Form.:
C34H66ClN11O5
Mol. Mass.:
744.412
SMILES:
CCCCCCCCCC(=O)N[C@@H](CCCNC(N)=N)C(=O)N[C@@H](C(C)C)C(=O)N[C@@H](CCCCN)C(=O)N[C@@H](CCCNC(N)=N)C(=O)CCl
: