Target
Proprotein convertase subtilisin/kexin type 6
Ligand
BDBM50533413
Substrate
Meas. Tech.
ChEMBL_1925260 (CHEMBL4428332)
Ki
3.6±n/a nM
Citation
 Kumar, RJuillerat-Jeanneret, LGolshayan, D Notch Antagonists: Potential Modulators of Cancer and Inflammatory Diseases. J Med Chem 59:7719-37 (2016)  
Target
Name:
Proprotein convertase subtilisin/kexin type 6
Synonyms:
PACE4 PCSK6_HUMAN | Subtilisin/kexin type 6
Type:
PROTEIN
Mol. Mass.:
106442.22
Organism:
Homo sapiens (Human)
Description:
ChEMBL_1290742
Residue:
969
  
Inhibitor
Name:
BDBM50533413
Synonyms:
CHEMBL3126388
Type:
Small organic molecule
Emp. Form.:
C34H66ClN11O5
Mol. Mass.:
744.412
SMILES:
CCCCCCCCCC(=O)N[C@@H](CCCNC(N)=N)C(=O)N[C@@H](C(C)C)C(=O)N[C@@H](CCCCN)C(=O)N[C@@H](CCCNC(N)=N)C(=O)CCl
: