Target
Potassium voltage-gated channel subfamily H member 2
Ligand
BDBM329203
Substrate
Meas. Tech.
ChEMBL_1925813 (CHEMBL4428885)
Ki
>30000±n/a nM
Citation
 DiMauro, EFAltmann, SBerry, LMBregman, HChakka, NChu-Moyer, MBojic, EFFoti, RSFremeau, RGao, HGunaydin, HGuzman-Perez, AHall, BEHuang, HJarosh, MKornecook, TLee, JLigutti, JLiu, DMoyer, BDOrtuno, DRose, PESchenkel, LBTaborn, KWang, JWang, YYu, VWeiss, MM Application of a Parallel Synthetic Strategy in the Discovery of Biaryl Acyl Sulfonamides as Efficient and Selective NaV1.7 Inhibitors. J Med Chem 59:7818-39 (2016)  
Target
Name:
Potassium voltage-gated channel subfamily H member 2
Synonyms:
1,3-beta-glucan synthase component GLS2 ERG Eag-related protein 1 Ether-a-go-go-related gene (HERG) Ether-a-go-go-related gene potassium channel 1 Ether-a-go-go-related gene potassium channel 1 (hERG1) Ether-a-go-go-related protein 1 H-ERG KCNH2 Potassium voltage-gated channel subfamily H member 2 (hERG) Voltage-gated potassium channel subunit Kv11.1 hERG Potassium Channel 1 | putative potassium channel subunit
Type:
Multi-pass membrane protein
Mol. Mass.:
126672.65
Organism:
Homo sapiens (Human)
Description:
Q12809
Residue:
1159
  
Inhibitor
Name:
BDBM329203
Synonyms:
4-(5-Chloro-6-((1-Methylcyclopropyl)Methoxy)Pyridin-3-yl)-2-Fluoro-5-Methoxy-N-(Methylsulfonyl)Benzamide US9663508, Example 705
Type:
Small organic molecule
Emp. Form.:
C20H14ClF3N2O5S
Mol. Mass.:
486.849
SMILES:
COc1cc(C(=O)NS(C)(=O)=O)c(F)cc1-c1cnc(Oc2cc(F)ccc2F)c(Cl)c1
: